{"text_format":"3","workbook":"xlsx","n_sheets":5,"sheets":["原版","Sheet3","挂网附件","不达标企业","Sheet2"],"not_rendered":{"defined_names":3,"comments":2},"read":"whole","date_system":"1900"}

{"sheet":"原版","index":0,"n_rows":316,"n_cols":11,"rows_kept":316,"hidden":true,"merged":[[0,0,0,1],[1,0,1,8],[3,0,4,0],[3,1,4,1],[3,5,4,5],[3,6,4,6],[3,7,4,7],[3,9,7,9],[3,10,7,10],[5,0,7,0],[5,1,7,1],[5,5,7,5],[5,6,7,6],[5,7,7,7],[8,0,11,0],[8,1,11,1],[8,4,11,4],[8,5,11,5],[8,6,11,6],[8,7,11,7],[8,8,22,8],[8,9,22,9],[8,10,22,10],[12,0,14,0],[12,1,14,1],[12,4,14,4],[12,5,14,5],[12,6,14,6],[12,7,14,7],[15,0,16,0],[15,1,16,1],[15,4,16,4],[15,5,16,5],[15,6,16,6],[15,7,16,7],[17,0,22,0],[17,1,22,1],[17,4,22,4],[17,5,22,5],[17,6,22,6],[17,7,22,7],[23,9,38,9],[23,10,38,10],[25,0,26,0],[25,1,26,1],[25,4,26,4],[39,9,42,9],[39,10,42,10],[41,0,42,0],[41,1,42,1],[41,5,42,5],[41,6,42,6],[41,7,42,7],[41,8,42,8],[43,0,44,0],[43,9,124,9],[43,10,124,10],[50,0,51,0],[57,0,58,0],[59,0,61,0],[65,0,66,0],[74,0,76,0],[78,0,79,0],[83,0,84,0],[87,0,88,0],[93,0,94,0],[121,0,122,0],[121,1,122,1],[125,9,143,9],[125,10,143,10],[131,0,135,0],[131,1,135,1],[131,4,135,4],[131,8,135,8],[139,0,141,0],[139,1,141,1],[139,4,141,4],[139,8,141,8],[144,9,168,9],[144,10,168,10],[146,0,148,0],[146,1,148,1],[146,4,148,4],[146,5,148,5],[169,9,201,9],[169,10,201,10],[170,0,172,0],[170,1,172,1],[174,0,175,0],[174,1,175,1],[176,0,178,0],[176,1,178,1],[179,0,181,0],[179,1,181,1],[184,0,188,0],[184,1,188,1],[192,0,193,0],[192,1,193,1],[199,0,200,0],[199,1,200,1],[202,0,203,0],[202,1,203,1],[202,8,203,8],[202,9,283,9],[202,10,283,10],[205,0,206,0],[205,1,206,1],[205,8,206,8],[207,0,208,0],[207,1,208,1],[209,0,211,0],[209,1,211,1],[209,8,211,8],[213,0,215,0],[213,1,215,1],[213,8,215,8],[216,0,217,0],[216,1,217,1],[218,0,220,0],[218,1,220,1],[223,0,224,0],[223,1,224,1],[228,0,229,0],[228,1,229,1],[233,0,236,0],[233,1,236,1],[237,0,238,0],[237,1,238,1],[239,0,242,0],[239,1,242,1],[245,0,246,0],[245,1,246,1],[245,8,246,8],[249,0,250,0],[249,1,250,1],[252,0,253,0],[252,1,253,1],[255,0,257,0],[255,1,257,1],[260,0,261,0],[260,1,261,1],[262,0,263,0],[262,1,263,1],[264,0,265,0],[264,1,265,1],[266,0,267,0],[266,1,267,1],[268,0,270,0],[268,1,270,1],[274,0,276,0],[274,1,276,1],[274,5,275,5],[274,6,275,6],[284,9,315,9],[284,10,315,10]]}
["附件："]
["核查情况表"]
["序号","企业名称","核查资质类别","等级","资质批准时间","核查情况","整改情况","是否撤回   资质","备注","各区申报意见","属地"]
[1,"苏州启迪盛银装饰科技有限公司","建筑装修装饰工程专业承包","壹级","2019-06-25","1、所有申报职称及技术工人均未人员信息采集。\n2、工人社保未提供。\n3、企业近一季度或当期合法的财务报表。（动态核查合格）\n4、未提供办公场所房产证明材料。\n5、装饰一级技术负责人姚明月：（1）职称（2011年10月，贝特装饰）与提供的业绩（蓝宝汽车2011年8月，盛银装饰）逻辑不符。（2）建造师（一级2019年12月取得）与以项目经理身份担任的业绩（2011年、2017年）不一致（不排除原先有二级建造师）。工作简历未提供且工作经历无法认定（标准10年）\n6、房建三级技术负责人姜滨海：（1）职称证（2010年9月）、建造师证（2010年6月）、简历（2002年至今盛银）与社保（2004年11月~12月；2017年8月~2020年5月）不相符；工作经历无法认定（标准5年）。（2）未提供2项符合房建三级的技术负责人个人业绩项目材料。\n7、职称人员：只确认已提供的暖通（侯跃飞）、电气（尤鸿鹄），缺少建筑工程相关专业4人。\n社保查询：社保为园区，无法查询",null,null,"重组合并分立","核查企业2家，涉及资质5项；\n不达标企业2家，涉及资质5项；","市直属"]
[null,null,"建筑工程施工总承包","叁级","2019-08-08",{"$nulls":3},"重组合并分立"]
[2,"苏州基业生态园林股份有限公司","水利水电工程施工总承包","叁级","2019-09-11","1、人员信息采集：（1）职称人员：魏建军、费莉莉、王军林已采集信息，其他人员均未信息采集。（2）技术工人：杨建权、王宝嘉、府斌、李锋、陈明、江斌已采集，其他人员均未采集。\n2、社保：提供的社保清单中缺少建造师周国、工人冯勇进。\n3、未提供办公场所房产证明材料。\n4、机电工程：（1）缺少技术负责人材料；（2）职称缺少焊接专业；\n5、水利水电工程：（1）技术负责人未提供基本情况及业绩表，且2项个人业绩指标均未达到标准中资质二级工程业绩要求，业绩时间重叠；（2）缺少水利水电工程相关专业人员10人；\n6、人员重复：（1）工人与建造师重复3人：李锋、周欢、府斌；（2）工人与职称重复1人叶丹。故对应标准，要么建造师、职称缺人，要么工人缺人。\n社保查询：待提供社保电子档后查询。",null,null,"重组合并分立"]
[null,null,"机电工程施工总承包","叁级","2019-09-11",{"$nulls":3},"重组合并分立"]
[null,null,"市政公用工程施工总承包","贰级","2019-07-07",{"$nulls":3},"重组合并分立"]
[3,"苏州大业建筑工程有限公司","市政公用工程施工总承包","叁级","2019-07-05","1、尚未办理安全生产许可证；\n2、技术负责人未设置，注册建造师、职称人员、技术工人0人；\n3、净资产达标并按时报送。",{"$nulls":3},"核查企业4家，涉及资质15项；\n不达标企业4家，涉及资质15项；","吴中区"]
[null,null,"地基基础工程专业承包","叁级"]
[null,null,"古建筑工程专业承包","叁级"]
[null,null,"城市及道路照明工程专业承包","叁级"]
[4,"苏州鑫峰兴市政建设工程有限公司","建筑工程施工总承包","叁级","2019-07-15","1、尚未办理安全生产许可证；\n2、技术负责人未设置；注册执业证书、职称证书、技术工人0人；\n3、尚未开通统计信息平台报送。"]
[null,null,"市政公用工程施工总承包","叁级"]
[null,null,"地基基础工程专业承包","叁级"]
[5,"苏州久恒建筑结构加固有限公司","地基基础工程专业承包","叁级","2019-10-09","1、技术负责人但未缴纳社保，未提供业绩；\n2、注册执业证书2人，职称人员1人，技术工人2人，部分人员未缴纳社保；\n3、企业净资产309.1万元（未达标），按时报送。"]
[null,null,"钢结构工程专业承包","叁级"]
[6,"苏州绿象征建设工程有限公司","建筑工程施工总承包","叁级","2019-07-15","1、技术负责人未设置；\n2、具有注册执业证书的10人（符合条件，5人为市政专业，4人为建筑专业，1人为机电和市政专业），具有职称证书的6人（建筑、城市及道路照明、环保符合条件，市政缺4人，钢结构缺4人，古建筑缺1人），技术工人15人（中级技术工13人，特殊工种2人，缺15人），部分人员未缴纳社保；\n3、净资产达标并按时报送。\n"]
[null,null,"市政公用工程施工总承包","叁级"]
[null,null,"钢结构工程专业承包","叁级"]
[null,null,"古建筑工程专业承包","叁级"]
[null,null,"城市及道路照明工程专业承包","叁级"]
[null,null,"环保工程专业承包","叁级"]
[7,"苏州佑铨环保工程有限公司","环保工程专业承包","叁级","2019-08-20","技术负责人和职称人员社保一个月。",null,null,"首次申请","核查企业15家，涉及资质16项；\n不达标企业1家，涉及资质1项","太仓"]
[8,"苏州镓诺华太环境建设有限公司","环保工程专业承包","贰级","2019-06-13","职称人员社保一个月。",null,null,"升级申请"]
[9,"江苏美杰欣建设发展有限公司","建筑工程施工总承包","贰级","2019-05-30","核查符合",null,null,"全资子公司间重组、分立"]
[null,null,"市政公用工程施工总承包","贰级",null,"核查符合",null,null,"全资子公司间重组、分立"]
[10,"江苏东投建设发展有限公司","建筑工程施工总承包","叁级","2019-08-20","技术负责人和职称人员社保一个月。",null,null,"增项申请"]
[11,"苏州科博思流体科技有限公司","建筑机电安装工程专业承包","叁级","2019-06-21","职称人员社保一个月。",null,null,"全资子公司间重组、分立"]
[12,"苏州市碧海永乐净化科技有限公司","建筑机电安装工程专业承包","叁级","2019-10-12","职称人员与申报时都不一致，社保提供一个月。",null,null,"首次申请"]
[13,"江苏仁诚建设工程有限公司","建筑工程施工总承包","贰级","2019-07-03","技术负责人及职称人员未见社保。",null,null,"升级申请"]
[14,"太仓市缘和装潢设计工程有限公司","建筑装修装饰工程专业承包","贰级","2019-08-05","技术负责人和职称人员社保一个月。",null,null,"首次申请"]
[15,"苏州颐德装饰工程有限公司","建筑工程施工总承包","叁级","2019-10-12","核查符合。",null,null,"增项申请"]
[16,"太仓市黑马建设发展有限公司","建筑装修装饰工程专业承包","贰级","2019-08-14","核查符合。",null,null,"全资子公司间重组、分立"]
[17,"苏州升耀建筑装饰有限公司","建筑装修装饰工程专业承包","壹级","2019-08-30","核查符合。",null,null,"升级申请"]
[18,"太仓市爱能吉电力工程有限公司","城市及道路照明工程专业承包","叁级","2019-10-12","技术负责人及职称人员与申报时不一致。",null,null,"增项申请"]
[19,"江苏沁福建筑工程有限公司","建筑工程施工总承包","贰级","2019-09-30","核查符合。",null,null,"全资子公司间重组、分立"]
[20,"江苏晋仓建筑工程有限公司","建筑工程施工总承包","贰级","2019-09-03","核查符合。",null,null,"全资子公司间重组、分立"]
[21,"江苏中为润泰建设有限公司","消防设施工程专业承包","贰级","2019-11-08","核查符合。",null,null,"增项申请"]
[22,"东方雨虹建设工程有限公司","建筑工程施工总承包","叁级","2019-07-01","资质标准达标",{"$nulls":4},"姑苏区"]
[23,"苏州亚厦建设工程有限公司","施工劳务不分专业","不分等级","2019-08-16","少人员：2人整改中"]
[24,"江苏铭瑞浩工程科技有限公司","建筑机电安装工程专业承包","叁级","2019-09-17","资质标准达标"]
[null,null,"环保工程专业承包","叁级","2019-09-17"]
[25,"江苏金厦建设集团有限公司","地基基础工程专业承包","壹级",20190513,"合格",null,null,"升级","核查企业67家，涉及资质82项；\n不达标企业45家，涉及资质52项；\n拟撤回资质企业0家，涉及资质0项。","张家港"]
[null,"江苏金厦建设集团有限公司","城市及道路照明工程专业承包","叁级",20190712,"合格",null,null,"重组分立"]
[26," 江苏兴安建设集团有限公司","建筑工程施工总承包","贰级",20190513,"合格",null,null,"升级"]
[27,"张家港市盛洲基础工程有限公司","地基基础工程专业承包","贰级",20190513,"合格",null,null,"升级"]
[28,"江苏励腾建设工程有限公司","特种工程(结构补强)专业承包","不分等级",20190527,"合格",null,null,"增项"]
[29,"江苏鲁班建设集团有限公司","古建筑工程专业承包","贰级",20190704,"合格",null,null,"重组分立"]
[30,"张家港市锦明环保工程装备有限公司","环保工程专业承包","贰级",20190620,"合格",null,null,"重组分立"]
[31,"张家港市西张建筑工程有限公司","建筑装修装饰工程专业承包","贰级",20190703,"合格",null,null,"增项"]
[null,"张家港市西张建筑工程有限公司","建筑幕墙工程专业承包","贰级",20190904,"合格",null,null,"重组分立"]
[32,"江苏捷兴机电设备安装工程有限公司","防水防腐保温工程专业承包","贰级",20190703,"合格",null,null,"增项"]
[33,"张家港市科伟建筑有限公司","建筑装修装饰工程专业承包","贰级",20190723,"合格",null,null,"增项"]
[34,"江苏鑫佳城建设发展有限公司","建筑装修装饰工程专业承包","贰级",20190723,"合格",null,null,"首次"]
[35,"江苏顺水源工业设备安装有限公司","消防设施工程专业承包","贰级",20190527,"合格",null,null,"首次"]
[36,"江苏联峰工业装备科技有限公司","环保工程专业承包","贰级",20190812,"合格",null,null,"重组分立"]
[37,"江苏凯沙电气有限公司","电力工程施工总承包","贰级",20190816,"合格",null,null,"升级"]
[null,"江苏凯沙电气有限公司","输变电工程专业承包","贰级",20190816,"合格",null,null,"升级"]
[38,"苏州如港建设工程有限公司","钢结构工程专业承包","叁级",20190820,"合格",null,null,"增项"]
[null,"苏州如港建设工程有限公司","建筑工程施工总承包","叁级",20190820,"合格",null,null,"增项"]
[null,"苏州如港建设工程有限公司","防水防腐保温工程专业承包","贰级",20190918,"合格",null,null,"增项"]
[39,"江苏兆建建设工程有限公司","建筑工程施工总承包","叁级",20190821,"合格",null,null,"重组分立"]
[40,"张家港市建筑设计研究院有限责任公司","特种工程(结构补强)专业承包","不分等级",20190705,"合格",null,null,"增项"]
[41,"苏州通港建筑工程有限公司","建筑装修装饰工程专业承包","贰级",20190723,"合格",null,null,"增项"]
[42,"江苏江厦建筑安装工程有限公司","消防设施工程专业承包","贰级",20190830,"合格",null,null,"增项"]
[null,"江苏江厦建筑安装工程有限公司","建筑装修装饰工程专业承包","贰级",20190830,"合格",null,null,"增项"]
[43,"江苏国安消防科技有限公司","消防设施工程专业承包","壹级",20190918,"合格",null,null,"升级"]
[44,"江苏扬鼎装饰工程有限公司","特种工程(结构补强)专业承包","不分等级",20190918,"合格",null,null,"增项"]
[45,"张家港市中海电气成套有限公司","电力工程施工总承包","叁级",20190911,"合格",null,null,"重组分立"]
[46,"江苏旭龙环境科技有限公司","环保工程专业承包","贰级",20190903,"合格",null,null,"重组分立"]
[47,"张家港市兴港混凝土有限公司","预拌混凝土专业承包","不分等级",20160616,"合格",null,null,"换证"]
[48,"张家港市伟泰混凝土有限公司","预拌混凝土专业承包","不分等级",20160510,"合格",null,null,"换证"]
[49,"张家港市垲锐保温材料有限公司","防水防腐保温工程专业承包","贰级",20190513,"无安许证、净资产申报不达标、技术负责人业绩不符、2名职称人员无社保、申请资质时承诺社保未提供","整改中","否，限期整改","首次"]
[50,"江苏冰河建筑装饰工程有限公司","建筑幕墙工程专业承包","贰级",20190513,"技术负责人业绩不符、缺1名建造师","整改中","否，限期整改","首次"]
[null,"江苏冰河建筑装饰工程有限公司","特种工程(结构补强)专业承包","不分等级",20190513,"技术负责人业绩不符","整改中","否，限期整改","首次"]
[null,"江苏冰河建筑装饰工程有限公司","建筑装修装饰工程专业承包","贰级",20190513,"技术负责人业绩不符","整改中","否，限期整改","首次"]
[51,"张家港市泓泰工业设备制造有限公司","建筑机电安装工程专业承包","叁级",20190523,"技术负责人业绩不符，4名职称人员专业不符，申请资质时承诺社保缺3人","整改中","否，限期整改","重组分立"]
[52,"张家港市厚上建设有限公司","建筑工程施工总承包","叁级",20190531,"技术负责人业绩不符、申请资质时承诺社保未提供","整改中","否，限期整改","重组分立"]
[null,"张家港市厚上建设有限公司","市政公用工程施工总承包","叁级",20190531,"技术负责人业绩不符、申请资质时承诺社保未提供","整改中","否，限期整改","重组分立"]
{"$rows_left_out":237}
{"sheet":"Sheet3","index":1,"n_rows":230,"n_cols":3,"rows_kept":230,"hidden":true}
["苏州启迪盛银装饰科技有限公司",{"$f":"VLOOKUP(A1,#REF!,2,)","v":{"$error":"#REF!"}},1]
["苏州基业生态园林股份有限公司",{"$f":"VLOOKUP(A2,#REF!,2,)","v":{"$error":"#REF!"}},2]
["苏州大业建筑工程有限公司",{"$f":"VLOOKUP(A3,#REF!,2,)","v":{"$error":"#REF!"}},3]
["苏州鑫峰兴市政建设工程有限公司",{"$f":"VLOOKUP(A4,#REF!,2,)","v":{"$error":"#REF!"}},4]
["苏州久恒建筑结构加固有限公司",{"$f":"VLOOKUP(A5,#REF!,2,)","v":{"$error":"#REF!"}},5]
["苏州绿象征建设工程有限公司",{"$f":"VLOOKUP(A6,#REF!,2,)","v":{"$error":"#REF!"}},6]
["苏州佑铨环保工程有限公司",{"$f":"VLOOKUP(A7,#REF!,2,)","v":{"$error":"#REF!"}},7]
["苏州镓诺华太环境建设有限公司",{"$f":"VLOOKUP(A8,#REF!,2,)","v":{"$error":"#REF!"}},8]
["江苏美杰欣建设发展有限公司",{"$f":"VLOOKUP(A9,#REF!,2,)","v":{"$error":"#REF!"}},9]
["江苏东投建设发展有限公司",{"$f":"VLOOKUP(A10,#REF!,2,)","v":{"$error":"#REF!"}},10]
["苏州科博思流体科技有限公司",{"$f":"VLOOKUP(A11,#REF!,2,)","v":{"$error":"#REF!"}},11]
["苏州市碧海永乐净化科技有限公司",{"$f":"VLOOKUP(A12,#REF!,2,)","v":{"$error":"#REF!"}},12]
["江苏仁诚建设工程有限公司",{"$f":"VLOOKUP(A13,#REF!,2,)","v":{"$error":"#REF!"}},13]
["太仓市缘和装潢设计工程有限公司",{"$f":"VLOOKUP(A14,#REF!,2,)","v":{"$error":"#REF!"}},14]
["苏州颐德装饰工程有限公司",{"$f":"VLOOKUP(A15,#REF!,2,)","v":{"$error":"#REF!"}},15]
["太仓市黑马建设发展有限公司",{"$f":"VLOOKUP(A16,#REF!,2,)","v":{"$error":"#REF!"}},16]
["苏州升耀建筑装饰有限公司",{"$f":"VLOOKUP(A17,#REF!,2,)","v":{"$error":"#REF!"}},17]
["太仓市爱能吉电力工程有限公司",{"$f":"VLOOKUP(A18,#REF!,2,)","v":{"$error":"#REF!"}},18]
["江苏沁福建筑工程有限公司",{"$f":"VLOOKUP(A19,#REF!,2,)","v":{"$error":"#REF!"}},19]
["江苏晋仓建筑工程有限公司",{"$f":"VLOOKUP(A20,#REF!,2,)","v":{"$error":"#REF!"}},20]
["江苏中为润泰建设有限公司",{"$f":"VLOOKUP(A21,#REF!,2,)","v":{"$error":"#REF!"}},21]
["东方雨虹建设工程有限公司",{"$f":"VLOOKUP(A22,#REF!,2,)","v":{"$error":"#REF!"}},22]
["苏州亚厦建设工程有限公司",{"$f":"VLOOKUP(A23,#REF!,2,)","v":{"$error":"#REF!"}},23]
["江苏铭瑞浩工程科技有限公司",{"$f":"VLOOKUP(A24,#REF!,2,)","v":{"$error":"#REF!"}},24]
["江苏金厦建设集团有限公司",{"$f":"VLOOKUP(A25,#REF!,2,)","v":{"$error":"#REF!"}},25]
[" 江苏兴安建设集团有限公司",{"$f":"VLOOKUP(A26,#REF!,2,)","v":{"$error":"#REF!"}},26]
["张家港市盛洲基础工程有限公司",{"$f":"VLOOKUP(A27,#REF!,2,)","v":{"$error":"#REF!"}},27]
["江苏励腾建设工程有限公司",{"$f":"VLOOKUP(A28,#REF!,2,)","v":{"$error":"#REF!"}},28]
["江苏鲁班建设集团有限公司",{"$f":"VLOOKUP(A29,#REF!,2,)","v":{"$error":"#REF!"}},29]
["张家港市锦明环保工程装备有限公司",{"$f":"VLOOKUP(A30,#REF!,2,)","v":{"$error":"#REF!"}},30]
["张家港市西张建筑工程有限公司",{"$f":"VLOOKUP(A31,#REF!,2,)","v":{"$error":"#REF!"}},31]
["江苏捷兴机电设备安装工程有限公司",{"$f":"VLOOKUP(A32,#REF!,2,)","v":{"$error":"#REF!"}},32]
["张家港市科伟建筑有限公司",{"$f":"VLOOKUP(A33,#REF!,2,)","v":{"$error":"#REF!"}},33]
["江苏鑫佳城建设发展有限公司",{"$f":"VLOOKUP(A34,#REF!,2,)","v":{"$error":"#REF!"}},34]
["江苏顺水源工业设备安装有限公司",{"$f":"VLOOKUP(A35,#REF!,2,)","v":{"$error":"#REF!"}},35]
["江苏联峰工业装备科技有限公司",{"$f":"VLOOKUP(A36,#REF!,2,)","v":{"$error":"#REF!"}},36]
["江苏凯沙电气有限公司",{"$f":"VLOOKUP(A37,#REF!,2,)","v":{"$error":"#REF!"}},37]
["苏州如港建设工程有限公司",{"$f":"VLOOKUP(A38,#REF!,2,)","v":{"$error":"#REF!"}},38]
["江苏兆建建设工程有限公司",{"$f":"VLOOKUP(A39,#REF!,2,)","v":{"$error":"#REF!"}},39]
["张家港市建筑设计研究院有限责任公司",{"$f":"VLOOKUP(A40,#REF!,2,)","v":{"$error":"#REF!"}},40]
["苏州通港建筑工程有限公司",{"$f":"VLOOKUP(A41,#REF!,2,)","v":{"$error":"#REF!"}},41]
["江苏江厦建筑安装工程有限公司",{"$f":"VLOOKUP(A42,#REF!,2,)","v":{"$error":"#REF!"}},42]
["江苏国安消防科技有限公司",{"$f":"VLOOKUP(A43,#REF!,2,)","v":{"$error":"#REF!"}},43]
["江苏扬鼎装饰工程有限公司",{"$f":"VLOOKUP(A44,#REF!,2,)","v":{"$error":"#REF!"}},44]
["张家港市中海电气成套有限公司",{"$f":"VLOOKUP(A45,#REF!,2,)","v":{"$error":"#REF!"}},45]
["江苏旭龙环境科技有限公司",{"$f":"VLOOKUP(A46,#REF!,2,)","v":{"$error":"#REF!"}},46]
["张家港市兴港混凝土有限公司",{"$f":"VLOOKUP(A47,#REF!,2,)","v":{"$error":"#REF!"}},47]
["张家港市伟泰混凝土有限公司",{"$f":"VLOOKUP(A48,#REF!,2,)","v":{"$error":"#REF!"}},48]
["张家港市垲锐保温材料有限公司",{"$f":"VLOOKUP(A49,#REF!,2,)","v":{"$error":"#REF!"}},49]
["江苏冰河建筑装饰工程有限公司",{"$f":"VLOOKUP(A50,#REF!,2,)","v":{"$error":"#REF!"}},50]
["张家港市泓泰工业设备制造有限公司",{"$f":"VLOOKUP(A51,#REF!,2,)","v":{"$error":"#REF!"}},51]
["张家港市厚上建设有限公司",{"$f":"VLOOKUP(A52,#REF!,2,)","v":{"$error":"#REF!"}},52]
[null,null,53]
["张家港双建保温防水工程有限公司",{"$f":"VLOOKUP(A54,#REF!,2,)","v":{"$error":"#REF!"}},54]
["张家港博赛建筑装饰有限公司",{"$f":"VLOOKUP(A55,#REF!,2,)","v":{"$error":"#REF!"}},55]
["苏州力一环境科技有限公司",{"$f":"VLOOKUP(A56,#REF!,2,)","v":{"$error":"#REF!"}},56]
["苏州兆达加固工程有限公司",{"$f":"VLOOKUP(A57,#REF!,2,)","v":{"$error":"#REF!"}},57]
["张家港市盛华幕墙工程有限公司",{"$f":"VLOOKUP(A58,#REF!,2,)","v":{"$error":"#REF!"}},58]
["张家港市荣华工业设备安装有限公司",{"$f":"VLOOKUP(A59,#REF!,2,)","v":{"$error":"#REF!"}},59]
["张家港市昌盛装饰工程有限公司",{"$f":"VLOOKUP(A60,#REF!,2,)","v":{"$error":"#REF!"}},60]
["张家港市亚宏钢结构工程有限公司",{"$f":"VLOOKUP(A61,#REF!,2,)","v":{"$error":"#REF!"}},61]
["张家港平乔建筑机械安装有限公司",{"$f":"VLOOKUP(A62,#REF!,2,)","v":{"$error":"#REF!"}},62]
["张家港市隆鑫金属制品有限公司",{"$f":"VLOOKUP(A63,#REF!,2,)","v":{"$error":"#REF!"}},63]
[" 江苏顺水源工业设备安装有限公司",{"$f":"VLOOKUP(A64,#REF!,2,)","v":{"$error":"#REF!"}},64]
["张家港市顺中建筑安装工程有限公司",{"$f":"VLOOKUP(A65,#REF!,2,)","v":{"$error":"#REF!"}},65]
["苏州枫昊环境科技有限公司",{"$f":"VLOOKUP(A66,#REF!,2,)","v":{"$error":"#REF!"}},66]
["苏州沃磁工业设备安装有限公司",{"$f":"VLOOKUP(A67,#REF!,2,)","v":{"$error":"#REF!"}},67]
["张家港市伟业机械制造有限公司",{"$f":"VLOOKUP(A68,#REF!,2,)","v":{"$error":"#REF!"}},68]
["江苏大世界建设有限公司",{"$f":"VLOOKUP(A69,#REF!,2,)","v":{"$error":"#REF!"}},69]
["江苏融源设备安装有限公司",{"$f":"VLOOKUP(A70,#REF!,2,)","v":{"$error":"#REF!"}},70]
["江苏绿亿医疗科技有限公司",{"$f":"VLOOKUP(A71,#REF!,2,)","v":{"$error":"#REF!"}},71]
["张家港市德诚鑫建设工程有限公司",{"$f":"VLOOKUP(A72,#REF!,2,)","v":{"$error":"#REF!"}},72]
["苏州恒耐建筑装饰工程有限公司",{"$f":"VLOOKUP(A73,#REF!,2,)","v":{"$error":"#REF!"}},73]
["张家港市利都清洗防水工程有限公司",{"$f":"VLOOKUP(A74,#REF!,2,)","v":{"$error":"#REF!"}},74]
["苏州堡诺装饰设计有限公司",{"$f":"VLOOKUP(A75,#REF!,2,)","v":{"$error":"#REF!"}},75]
["江苏荣厦建设工程有限公司",{"$f":"VLOOKUP(A76,#REF!,2,)","v":{"$error":"#REF!"}},76]
["江苏铜釜建设工程有限公司",{"$f":"VLOOKUP(A77,#REF!,2,)","v":{"$error":"#REF!"}},77]
["苏州前迅机电科技有限公司",{"$f":"VLOOKUP(A78,#REF!,2,)","v":{"$error":"#REF!"}},78]
["苏州市太平洋智能化工程有限公司",{"$f":"VLOOKUP(A79,#REF!,2,)","v":{"$error":"#REF!"}},79]
["苏州首创科技发展有限公司",{"$f":"VLOOKUP(A80,#REF!,2,)","v":{"$error":"#REF!"}},80]
{"$rows_left_out":151}
{"sheet":"挂网附件","index":2,"n_rows":226,"n_cols":3,"rows_kept":226,"hidden":true}
["企业名称","核查资质专业","等级"]
["苏州启迪盛银装饰科技有限公司","建筑装修装饰工程专业承包","壹级"]
["苏州启迪盛银装饰科技有限公司","建筑工程施工总承包","叁级"]
["苏州基业生态园林股份有限公司","水利水电工程施工总承包","叁级"]
["苏州基业生态园林股份有限公司","机电工程施工总承包","叁级"]
["苏州大业建筑工程有限公司","市政公用工程施工总承包","叁级"]
["苏州大业建筑工程有限公司","地基基础工程专业承包","叁级"]
["苏州大业建筑工程有限公司","古建筑工程专业承包","叁级"]
["苏州大业建筑工程有限公司","城市及道路照明工程专业承包","叁级"]
["苏州鑫峰兴市政建设工程有限公司","建筑工程施工总承包","叁级"]
["苏州鑫峰兴市政建设工程有限公司","市政公用工程施工总承包","叁级"]
["苏州鑫峰兴市政建设工程有限公司","地基基础工程专业承包","叁级"]
["苏州久恒建筑结构加固有限公司","地基基础工程专业承包","叁级"]
["苏州久恒建筑结构加固有限公司","钢结构工程专业承包","叁级"]
["苏州绿象征建设工程有限公司","建筑工程施工总承包","叁级"]
["苏州绿象征建设工程有限公司","市政公用工程施工总承包","叁级"]
["苏州绿象征建设工程有限公司","钢结构工程专业承包","叁级"]
["苏州绿象征建设工程有限公司","古建筑工程专业承包","叁级"]
["苏州绿象征建设工程有限公司","城市及道路照明工程专业承包","叁级"]
["苏州绿象征建设工程有限公司","环保工程专业承包","叁级"]
["江苏仁诚建设工程有限公司","建筑工程施工总承包","贰级"]
["苏州亚厦建设工程有限公司","施工劳务不分专业","不分等级"]
["张家港市垲锐保温材料有限公司","防水防腐保温工程专业承包","贰级"]
["江苏冰河建筑装饰工程有限公司","建筑幕墙工程专业承包","贰级"]
["江苏冰河建筑装饰工程有限公司","特种工程(结构补强)专业承包","不分等级"]
["江苏冰河建筑装饰工程有限公司","建筑装修装饰工程专业承包","贰级"]
["张家港市泓泰工业设备制造有限公司","建筑机电安装工程专业承包","叁级"]
["张家港市厚上建设有限公司","建筑工程施工总承包","叁级"]
["张家港市厚上建设有限公司","市政公用工程施工总承包","叁级"]
["江苏鲁班建设集团有限公司","电子与智能化工程专业承包","贰级"]
["张家港双建保温防水工程有限公司","防水防腐保温工程专业承包","贰级"]
["张家港博赛建筑装饰有限公司","消防设施工程专业承包","贰级"]
["苏州力一环境科技有限公司","建筑机电安装工程专业承包","叁级"]
["苏州力一环境科技有限公司","环保工程专业承包","叁级"]
["苏州兆达加固工程有限公司","特种工程(结构补强)专业承包","不分等级"]
["张家港市盛华幕墙工程有限公司","建筑幕墙工程专业承包","贰级"]
["张家港市荣华工业设备安装有限公司","地基基础工程专业承包","叁级"]
["张家港市荣华工业设备安装有限公司","城市及道路照明工程专业承包","叁级"]
["张家港市昌盛装饰工程有限公司","建筑装修装饰工程专业承包","贰级"]
["张家港市亚宏钢结构工程有限公司","钢结构工程专业承包","叁级"]
["张家港平乔建筑机械安装有限公司","起重设备安装工程专业承包","叁级"]
["张家港市隆鑫金属制品有限公司","钢结构工程专业承包","叁级"]
[" 江苏顺水源工业设备安装有限公司","建筑工程施工总承包","叁级"]
[" 江苏顺水源工业设备安装有限公司","机电工程施工总承包","叁级"]
["张家港市顺中建筑安装工程有限公司","建筑工程施工总承包","叁级"]
["苏州枫昊环境科技有限公司","环保工程专业承包","叁级"]
["苏州沃磁工业设备安装有限公司","建筑机电安装工程专业承包","叁级"]
["张家港市伟业机械制造有限公司","建筑机电安装工程专业承包","叁级"]
["江苏大世界建设有限公司","建筑工程施工总承包","叁级"]
["江苏融源设备安装有限公司","消防设施工程专业承包","贰级"]
["江苏绿亿医疗科技有限公司","建筑机电安装工程专业承包","叁级"]
["张家港市德诚鑫建设工程有限公司","地基基础工程专业承包","叁级"]
["苏州恒耐建筑装饰工程有限公司","消防设施工程专业承包","贰级"]
["张家港市利都清洗防水工程有限公司","防水防腐保温工程专业承包","贰级"]
["苏州堡诺装饰设计有限公司","建筑装修装饰工程专业承包","贰级"]
["江苏荣厦建设工程有限公司","建筑工程施工总承包","叁级"]
["江苏铜釜建设工程有限公司","建筑工程施工总承包","叁级"]
["苏州前迅机电科技有限公司","电子与智能化工程专业承包","贰级"]
["苏州市太平洋智能化工程有限公司","电子与智能化工程专业承包","贰级"]
["苏州首创科技发展有限公司","电子与智能化工程专业承包","贰级"]
["苏州鑫强装饰工程有限公司","建筑装修装饰工程专业承包","贰级"]
["张家港国华新能源有限公司","建筑机电安装工程专业承包","叁级"]
["张家港和庆机械设备租赁有限公司","起重设备安装工程专业承包","贰级"]
["张家港满堂红装饰工程有限公司","建筑装修装饰工程专业承包","贰级"]
["张家港市典石装饰工程有限公司","建筑装修装饰工程专业承包","贰级"]
["张家港市东润智能电气有限公司","电子与智能化工程专业承包","贰级"]
["张家港市恒泰建筑工程有限公司","建筑工程施工总承包","叁级"]
["张家港鑫灶林建筑装饰有限公司","建筑装修装饰工程专业承包","贰级"]
["江苏金烁工程总承包有限公司","建筑工程施工总承包","叁级"]
["江苏赛富隆重工有限公司","钢结构工程专业承包","贰级"]
["江苏盛港建设安装工程有限公司","石油化工工程施工总承包","叁级"]
["江苏盛港建设安装工程有限公司","城市及道路照明工程专业承包","叁级"]
["江苏新中环保股份有限公司","建筑机电安装工程专业承包","叁级"]
["张家港市永康建筑工程有限公司","模板脚手架专业承包","不分等级"]
["苏州市舍利彩钢复新工程有限公司","防水防腐保温工程专业承包","贰级"]
["江苏虞丰装饰工程有限公司","建筑机电安装工程专业承包","叁级"]
["苏州市禾众盛成套机电设备有限公司","建筑机电安装工程专业承包","叁级"]
["江苏中宸建筑装饰工程有限公司","建筑装修装饰工程专业承包","贰级"]
["江苏雁锦建设工程有限公司","建筑工程施工总承包","叁级"]
["江苏中凯建设工程有限公司","地基基础工程专业承包","叁级"]
{"$rows_left_out":147}
{"sheet":"不达标企业","index":3,"n_rows":16,"n_cols":4,"rows_kept":16,"merged":[[0,0,0,3],[1,0,2,0],[1,1,2,1],[1,2,1,3]]}
["建筑业企业资质核查不合格企业名单（5月11日）"]
["序号","企业名称","核查不达标资质"]
[null,null,"类别","等级"]
[1,"江苏成尚承建设有限公司","模板脚手架专业承包","不分等级"]
[2,"南京仁高建设工程有限公司","模板脚手架专业承包","不分等级"]
[3,"南京博浩脚手架工程有限公司","模板脚手架专业承包","不分等级"]
[4,"江苏铁驰建设发展有限公司","模板脚手架专业承包","不分等级"]
[5,"南京依维建筑安装工程有限公司","模板脚手架专业承包","不分等级"]
[6,"江苏弘邃建设工程有限公司","模板脚手架专业承包","不分等级"]
[7,"南京赛能建设工程有限公司","模板脚手架专业承包","不分等级  "]
[8,"江苏方赫城建设工程有限公司","模板脚手架专业承包","不分等级  "]
[9,"江苏盛宏汇建设工程有限公司","模板脚手架专业承包","不分等级  "]
[10,"南京地球村防腐保温工程有限公司","模板脚手架专业承包","不分等级"]
[11,"南京福彪预拌混凝土有限公司","预拌混凝土专业承包","不分等级"]
[12,"南京巨佑阳建设工程有限公司","专业承包模板脚手架","不分等级"]
[13,"江苏卡博特建设工程有限公司","专业承包模板脚手架","不分等级"]

{"sheet":"Sheet2","index":4,"n_rows":0,"n_cols":0,"rows_kept":0}